Error from Java to Aix (editor.appybuilder)


#1

Hi all,

can anyone help me to fixed that ??

Any suggestion about that logg from editor appybuilder ??? how can i fixed


Buildfile: /projects/goldv2/appinventor-sources/appinventor/build.xml

extensions:

clean:
[delete] Deleting directory /projects/goldv2/appinventor-sources/appinventor/build/components

BUILD FAILED
/projects/goldv2/appinventor-sources/appinventor/build.xml:34: The following error occurred while executing this line:
/projects/goldv2/appinventor-sources/appinventor/build-common.x
init:

common_CommonUtils:

init:

CommonUtils:

common_CommonVersion:

init:

CommonVersion:
[exec] Result: 128
[exec] Result: 128

CopyToRunLibDir:

components_AndroidRuntime:

init:
[mkdir] Created dir: /projects/goldv2/appinventor-sources/appinventor/build/components
[mkdir] Created dir: /projects/goldv2/appinventor-sources/appinventor/components/build
[mkdir] Created dir: /projects/goldv2/appinventor-sources/appinventor/components/build/classes
[mkdir] Created dir: /projects/goldv2/appinventor-sources/appinventor/components/reports
[mkdir] Created dir: /projects/goldv2/appinventor-sources/appinventor/components/reports/raw
[mkdir] Created dir: /projects/goldv2/appinventor-sources/appinventor/components/reports/html

CommonConstants:
[mkdir] Created dir: /projects/goldv2/appinventor-sources/appinventor/components/build/classes/CommonConstants
[javac] Compiling 6 source files to /projects/goldv2/appinventor-sources/appinventor/components/build/classes/CommonConstants
[javac] warning: [options] bootstrap class path not set in conjunction with -source 1.7
[javac] 1 warning
[javac] Creating empty /projects/goldv2/appinventor-sources/appinventor/components/build/classes/CommonConstants/com/google/appinventor/components/common/package-info.class
[jar] Building jar: /projects/goldv2/appinventor-sources/appinventor/build/components/CommonConstants.jar
[jar] Building jar: /projects/goldv2/appinventor-sources/appinventor/build/components/CommonConstants-gwt.jar

HtmlEntities:
[mkdir] Created dir: /projects/goldv2/appinventor-sources/appinventor/components/build/classes/HtmlEntities
[javac] Compiling 1 source file to /projects/goldv2/appinventor-sources/appinventor/components/build/classes/HtmlEntities
[javac] warning: [options] bootstrap class path not set in conjunction with -source 1.7
[javac] 1 warning
[jar] Building jar: /projects/goldv2/appinventor-sources/appinventor/components/build/HtmlEntities.jar

common_CommonVersion:

init:

CommonVersion:
[exec] Result: 128
[exec] Result: 128

AndroidRuntime:
[mkdir] Created dir: /projects/goldv2/appinventor-sources/appinventor/components/build/classes/AndroidRuntime
[javac] Compiling 331 source files to /projects/goldv2/appinventor-sources/appinventor/components/build/classes/AndroidRuntime
[javac] warning: [options] bootstrap class path not set in conjunction with -source 1.7
[javac] /projects/goldv2/appinventor-sources/appinventor/components/src/com/appybuilder/sandgavag/AdMobInterstitial/AdMobInterstitial.java:56: error: cannot find symbol
[javac] private InterstitialAd interstitialAd;
[javac] ^
[javac] symbol: class InterstitialAd
[javac] location: class AdMobInterstitial
[javac] /projects/goldv2/appinventor-sources/appinventor/components/src/com/appybuilder/sandgavag/AdMobInterstitial/AdMobInterstitial.java:101: error: cannot find symbol
[javac] public class AdListenerPage extends AdListener {
[javac] ^
[javac] symbol: class AdListener
[javac] location: class AdMobInterstitial
[javac] /projects/goldv2/appinventor-sources/appinventor/components/src/com/appybuilder/sandgavag/AdMobInterstitial/AdMobInterstitial.java:137: error: cannot find symbol
[javac] this.interstitialAd = new InterstitialAd(container.$context());
[javac] ^
[javac] symbol: class InterstitialAd
[javac] location: class AdMobInterstitial
[javac] /projects/goldv2/appinventor-sources/appinventor/components/src/com/appybuilder/sandgavag/AdMobInterstitial/AdMobInterstitial.java:225: error: cannot find symbol
[javac] this.interstitialAd.loadAd(new Builder().addTestDevice(AdMobUtil.guessSelfDeviceId(this.container.$context())).build());
[javac] ^
[javac] symbol: class Builder
[javac] location: class AdMobInterstitial
[javac] /projects/goldv2/appinventor-sources/appinventor/components/src/com/appybuilder/sandgavag/AdMobInterstitial/AdMobInterstitial.java:229: error: cannot find symbol
[javac] Builder builder = new Builder();
[javac] ^
[javac] symbol: class Builder
[javac] location: class AdMobInterstitial
[javac] /projects/goldv2/appinventor-sources/appinventor/components/src/com/appybuilder/sandgavag/AdMobInterstitial/AdMobInterstitial.java:229: error: cannot find symbol
[javac] Builder builder = new Builder();
[javac] ^
[javac] symbol: class Builder
[javac] location: class AdMobInterstitial
[javac] /projects/goldv2/appinventor-sources/appinventor/components/src/com/appybuilder/sandgavag/AdMobInterstitial/AdMobInterstitial.java:247: error: cannot find symbol
[javac] builder.addNetworkExtrasBundle(AdMobAdapter.class, extras);
[javac] ^
[javac] symbol: class AdMobAdapter
[javac] location: class AdMobInterstitial
[javac] Note: Some input files use or override a deprecated API.
[javac] Note: Recompile with -Xlint:deprecation for details.
[javac] Note: Some input files use unchecked or unsafe operations.
[javac] Note: Recompile with -Xlint:unchecked for details.
[javac] 7 errors
[javac] 1 warning

BUILD FAILED
/projects/goldv2/appinventor-sources/appinventor/build.xml:35: The following error occurred while executing this line:
/projects/goldv2/appinventor-sources/appinventor/build-common.xml:372: The following error occurred while executing this line:
/projects/goldv2/appinventor-sources/appinventor/components/build.xml:141: The following error occurred while executing this line:
/projects/goldv2/appinventor-sources/appinventor/build-common.xml:118: Compile failed; see the compiler error output for details.

Total time: 4 seconds


#2

This is compile error. You are trying to build AdMob extension, but there is no AdMob library available in the CodeEditor


#3

oh i see…thanks hosein


#4

This post was flagged by the community and is temporarily hidden.